hospital,ID,gaweeks,birthweight,Plcbirth,tempadNICU,Basexcess,Inotrope,Startinotrope,EstartTIdays,LstartTIdays,Inotropedrug,Combinotropes,MaxCreat,MaxK,Oxygendepend36,NEC,PDARx,Postnatalsteroids,Daystartsteroids,PVL,ParenchymalH,DeathBdischarge,DischargHosp,ICdays,HDdays,SCBUdays,CRIB,Sex,ComplicatPreg,Doppler,Chorioamnionitis,PIH,APH,Firsthb,VolRBCtrans72,OtherBloodPrd72,VolFFP,VolCryo,VolAlb,VolPlatelets,VolNorSaline,Ethnicity,a_stds
1,"2173726","23+6",648,2,37,-11.9,2,,6,,5,"1,2",112,9.19999999999999,2,3,1,1,,1,1,1,2,66,28,47,15,2,"1",1,1,1,1,9.800000000000001,60,2,15,,,,,1,1
1,"2128275","23+1",507,1,36,-8.800000000000001,3,27,,4,5,"1,2",77,6.4,1,4,2,1,,1,2,2,,31,,,15,2,"maternal chorioamnionitis,",1,2,1,1,11.4,60,1,,,,,,1,1
2,"9107041","23",460,1,36.2,-7.8,3,7,,34,5,"1,2,3",94,7.2,1,1,2,2,18,1,3,2,,67,,,13,2,"prom,choriamnionitis",1,2,1,1,17,45,2,,,,15,,1,1
2,"6540001","23+0",588,1,35.5,-2,2,7,4,41,1,".",93,6.5,2,4,2,1,,1,1,2,,115,,,16,1,"cervical sutre x 2",3,1,1,1,11,52,1,,,,,10,4,1
2,"9087333","23+5",700,1,37.3,-1.6,1,,,,,".",87,5.5,2,2,3,3,63,1,2,1,2,66,192,12,13,1,"PROM",3,2,1,1,13.9,30,1,,,,15,,4,1
1,"2127257","23+4",542,1,36.3,-16.3,3,17,,12,1,".",71,7.1,1,5,1,1,,1,4,2,,59,,,16,2,"1",1,1,1,1,9.69999999999999,45,1,,,,,,2,2
1,"2273531","23+4",580,1,36.5,-.8,3,68,,3,1,".",90,6.1,2,1,3,3,72,1,1,2,,152,59,,13,2,"1",3,2,1,1,11.8,15,1,,,,,,1,1
1,"2161843","23+4",564,2,33,-8.5,2,,2,,1,".",75,7.3,1,1,1,1,,1,1,2,,3,,,18,1,"cervical suture",3,1,1,2,11.6,30,1,,,,,,4,1
2,"9345888","23+1",550,1,36.2,-8.4,2,,2,,5,"1,2",67,8.1,1,1,1,1,,1,2,2,,2,,,16,1,"pv bleed preterm labour",1,1,1,2,12,45,2,30,15,,,10,4,1
1,"2297908","23+2",510,1,36.6,-8.69999999999999,2,,1,,5,"1,2",62,7.2,1,1,1,1,,1,1,2,,1,,,15,2,"APH, preterm labour",1,1,1,2,12.6,30,1,,,,,10,1,1
1,"2276666","23+5",500,1,36,-7.9,1,,,,,".",68,9.6,2,1,2,1,,1,1,1,2,69,28,58,15,1,"1",1,2,1,1,11.8,45,2,15,,,,,1,2
2,"9202833","23+4",620,1,36.7,-7.5,2,,2,,1,".",76,10,1,1,1,1,,1,5,2,,2,,,16,2,"1",1,1,1,2,14.5,15,2,15,,,,20,4,1
1,"2304292","23+4",560,2,34.7,-11.6,2,,4,,1,".",59,6.1,1,4,1,1,,1,1,2,2,12,,,16,2,"1",1,1,1,1,14.6,15,1,,,,,,2,1
2,"9088084","23+1",636,2,34.3,10.1,2,,4,,1,".",126,10.3,1,1,1,1,,1,3,2,2,6,,,18,1,"1",1,1,1,1,15.3,45,2,15,,,,,5,1
1,"2168242","23+3",592,1,36.4,-7.9,1,,,,,".",106,8.5,1,1,1,1,,1,1,2,,9,,,12,2,"raised crp",1,1,1,1,14,45,2,,,,15,10,1,1
2,"9282243","23+2",650,1,36.3,-8.5,2,6,3,15,1,".",86,6.7,2,1,2,3,64,1,1,1,2,67,45,36,15,1,"Early labour",1,1,1,1,15.6,20,2,,10,10,20,10,1,1
1,"2236195","23+4",608,2,34,-25.5,2,,3,,1,".",88,8.800000000000001,1,1,1,1,,1,3,2,,3,,,21,1,"1",1,2,1,2,13.2,30,2,30,,,,10,4,1
2,"9054032","23+5",610,2,36.2,-7.8,2,,3,,1,".",83,8.19999999999999,2,1,2,1,,1,1,2,,65,12,,18,1,"1",1,1,1,1,11.5,30,2,15,,,,,1,1
2,"9228690","23+4",624,1,36,-11.4,2,,41,,5,"1,2,4",107,5.7,2,4,1,1,,1,2,2,,77,24,,17,1,"ivf,multiple pregnancy,dichorionic-di amniotic",1,1,1,2,9.300000000000001,60,2,15,,,15,10,4,1
2,"6569970","23+0",436,1,35.6,-10.5,2,,4,,1,".",88,10,1,1,1,1,,1,1,2,,4,,,19,1,"Cervical suture around 17 weeks. Came in at 22 weeks c/o abdominal pain. Onset of labour due to ?infection of suture.",3,1,1,1,13.6,30,2,15,,,15,20,4,3
2,"9085797","23+5",612,1,36.6,-6,3,5,,3,5,"1 and 3",138,4,1,2,1,1,,1,1,2,,8,,,12,2,"PROM",3,1,1,1,13.6,30,1,,,,,,4,1
1,"2143737","23+4",660,2,36.6,-.2,2,,4,,1,".",103,6.9,1,1,1,1,,1,1,2,,11,,,14,1,"preterm labour",2,1,1,1,12.1,30,2,15,,,,10,1,1
2,"9064067","23",582,1,33.2,-7.7,2,13,1,25,5,"1,2",63,9.1,2,1,3,1,,1,2,1,2,11,45,68,15,2,"1",2,1,1,1,14.7,15,1,,,,,20,4,1
2,"9196719","23+4",620,1,36,-5.8,2,40,21,8,5,"1,3",74,5.4,2,4,3,3,65,1,3,1,2,118,148,,16,1,"preterm labour, cervical suture in situ",1,1,1,1,16.4,45,2,15,,30,,20,4,1
1,"2190030","23+2",670,1,36.8,-4.2,2,,2,,1,".",79,8.4,1,4,2,3,22,1,5,2,,31,,,15,1,"uti on antibiotics",3,1,1,1,13.7,45,1,,,,,,1,1
2,"9165786","23+2",545,1,35.6,,2,,7,,1,".",107,6.5,2,4,2,1,,1,1,1,1,53,30,70,,1,"oligohydramnions,choriamnionitis,prom",1,2,1,1,15,,1,,,,,,4,1
1,"2185369","23+6",730,2,34.2,-5.5,2,,2,,1,".",68,7.7,1,1,1,1,,1,2,2,,3,,,16,2,"smoking during pregnancy",1,1,1,2,11.9,60,1,,,,,,2,1
2,"9231481","23+3",500,2,36,-10.9,2,,21,,5,"1,2",73,6.4,2,1,2,3,51,1,2,1,2,62,19,57,17,2,"prom,choriamnionitis",1,2,1,1,14,15,1,,,,,20,1,1
1,"2169312","23+2",580,1,36,-11.5,2,,2,,1,".",75,8.1,1,1,1,1,,1,3,2,,3,,,16,2,"mum smoked during pregnancy",1,1,1,2,15.1,30,2,30,,,,,2,1
2,"9104403","23+6",590,1,,,3,7,,10,5,"1,2,4",83,8.69999999999999,2,4,2,1,,1,2,2,2,66,65,,15,1,"asthma,?swine flu.",1,1,1,1,12,45,2,15,,,,10,4,1
2,"9122680","23+6",680,2,37.6,-17,2,,2,,5,"1,2.3",93,7.3,1,1,1,1,,1,4,2,,2,,,18,1,"1",3,1,1,1,13,20,2,15,15,,,,4,1
1,"2187199","23+3",500,1,35.8,-9,2,,2,,1,".",89,9.6,1,1,1,1,,1,2,2,,3,,,17,2,"1",1,1,1,1,11.6,60,2,30,,,,,1,1
2,"6596148","23+3",690,1,37.2,-2,2,,21,,1,".",105,6.6,2,1,2,1,,1,5,2,2,6,33,,16,1,"breech",1,1,1,1,13.8,45,1,,,,,10,1,1
1,"2195419","23+6",637,1,36.4,-4.7,2,30,5,4,5,"1,2",136,4.8,2,4,2,1,,1,2,1,2,34,40,28,15,2,"1",1,1,1,2,14.1,45,2,15,,,,,2,1
1,"2197655","23+6",590,1,33,-4.8,2,,1,,1,".",101,6,1,1,1,1,,1,2,2,,10,,,17,1,"prom,oligohydramnions",1,1,1,2,16.7,15,1,,,,,,2,1
2,"6480152","23+1",665,2,36,-6.7,2,,2,,1,".",109,10.7,1,1,1,1,,1,5,2,,2,,,15,1,"1",3,1,1,1,13.3,30,2,15,,,,,2,1
1,"2277567","23+6",630,1,36,-17.8,3,92,,9,5,"1,2,4",72,6.4,2,2,2,1,,1,3,2,,101,,,17,2,"ivf pregnancy,prom",1,1,1,1,12.4,45,2,15,,,,20,2,1
1,"2338162","23+6",731,1,33,-7.8,2,,2,,1,".",85,6.6,2,3,1,1,,1,5,1,2,65,60,44,14,1,"1",1,1,1,1,12.4,60,2,45,30,,,,1,1
2,"9156221","23+5",580,1,35.8,-5.7,2,,4,,1,".",159,9.1,2,2,1,1,,1,1,1,1,49,32,45,15,2,"prom,placenta previa, aph",1,1,1,2,12.5,45,2,15,,,,20,4,1
1,"2277351","23",500,2,36.4,-10.2,1,,,,,".",67,9.1,1,1,1,1,,1,5,2,,2,,,18,2,"1",1,1,1,1,12.1,30,2,15,,,,,2,1
1,"2307597","23+6",566,2,33.6,-12.9,2,,5,,1,".",71,6.3,1,1,1,1,,1,5,2,,8,,,18,1,"prom",1,2,1,1,14.1,30,2,15,,,,10,2,1
1,"2241183","23+6",590,1,36.7,-5.4,3,7,,10,5,"1,2,4",83,8.69999999999999,2,4,2,1,,1,2,2,2,66,65,,15,1,"asthma,?swine flu.",1,1,1,1,12,45,2,15,,,,10,4,3
1,"2157812","23+6",620,1,36.3,-6.8,3,4,,1,1,".",77,8.19999999999999,1,1,1,1,,1,3,2,,4,,,13,2,"ivf,choriamnionitis,cervical suture",3,2,1,1,13.1,45,2,15,,,,,4,1
1,"2343294","23+5",540,2,36.4,-8.5,2,,4,,1,".",87,9,1,1,1,1,,1,4,2,2,13,,,13,2,"polycystic overies",1,1,1,1,11.4,45,1,,,,,,4,3
2,"9228688","23+4",610,1,36.5,-6.8,2,,23,,1,".",96,7.3,2,4,2,3,166,1,1,1,1,100,172,36,14,2,"APH",3,1,1,2,12.9,30,1,,,,,10,4,1
2,"9282242","24",640,1,36.3,-3.1,2,,4,,1,".",91,8.300000000000001,1,1,1,1,,1,5,2,,6,,,14,1,"1",1,1,1,1,18.8,45,2,45,15,,,20,1,1
1,"2200144","24+2",642,1,36.6,-13.7,3,4,,1,1,".",62,6.4,2,4,1,1,,1,1,1,2,98,50,45,14,2,"multiple pregnancy",1,1,1,1,15.3,30,1,,,,,,5,1
1,"2289202","24+1",540,1,36.7,-6.6,1,,,,,".",69,8.300000000000001,1,1,1,1,,1,5,2,,3,,,15,2,"pih,type 2 diabetes on insulin",2,1,2,1,14.1,15,2,15,,,,,2,1
2,"6578753","24",650,1,36.4,,3,7,,18,5,"1,2",90,6.3,2,2,2,3,51,1,5,2,,110,40,,14,2,"1",3,1,1,1,14.9,30,2,60,,,,10,4,1
2,"9138939","24+6",716,1,35.5,,1,,,,,".",152,8,2,4,2,1,,1,1,1,1,40,55,28,,1,"aph",1,1,1,2,14.4,,1,,,,,,4,1
1,"2359875","24+2",680,1,36.8,-7.4,1,,,,,".",82,5.3,2,1,2,1,,1,3,1,2,77,25,79,12,1,"multiple pregnancy",1,1,1,1,15.8,15,1,,,,,,2,1
1,"2142380","24+6",790,2,35.6,-3.9,2,,5,,5,"1,2",86,6.6,1,1,1,1,,1,5,2,,7,,,14,2,"1",3,1,1,1,14.9,75,2,45,,,,10,2,1
2,"9258383","24+0",660,2,35.2,-3.4,2,18,4,1,1,".",92,7.9,1,4,2,1,,1,1,2,2,18,,,13,1,"3 2nd trimester PV bleeds",1,1,1,2,18.6,15,1,,,,,10,4,1
1,"2210722","24+6",750,2,35.6,-6,1,,,,,".",75,5.8,1,1,2,1,,1,1,1,2,39,29,25,12,1,"1",1,1,1,1,15.4,15,2,,15,,,,1,1
2,"6535244","24+5",730,1,35.4,-14,2,17,6,8,1,".",103,4.9,1,1,1,2,21,2,3,2,,27,,,17,1,"smoked during pregnancy",3,1,1,1,11.8,65,2,45,,,,10,2,3
1,"2127508","24+6",700,2,36.8,-8.800000000000001,2,,7,,5,"1,2",86,6.6,2,4,3,3,,1,3,2,2,104,,,15,1,"placental abruption, cord prolapse, preterm labour",1,1,1,2,16.5,45,2,15,,,,20,4,1
1,"2127596","24",725,1,36.1,-3.4,1,,,,,".",59,7.6,2,3,2,1,,1,1,1,2,61,23,36,13,2,"maternal gbs positive",1,1,1,1,15.7,30,1,,,,,,1,1
2,"9108786","24+3",656,2,36.4,,2,36,27,8,5,"1,2,3",101,5.6,2,2,3,3,30,1,3,1,2,64,58,46,14,2,"maternal uti, anti natal steroid given",1,1,1,1,18.8,15,1,,,,,10,2,2
1,"2329862","24+3",510,1,35.6,,1,,,,,".",113,7,1,3,1,1,,1,2,1,2,69,14,43,15,2,"prom,cervical suture",3,1,1,1,7.9,45,2,,,15,,,2,1
2,"6547846","24+6",822,1,37.6,-7.9,2,,1,,1,".",78,6.8,2,1,1,1,,1,1,1,1,14,78,77,12,1,"1",1,1,1,1,14.1,30,1,,,,,10,1,1
2,"9210769","24+2",700,1,36.9,-2.3,3,4,,17,1,".",76,5.7,1,1,2,3,45,1,1,1,1,54,54,31,14,2,"gdm,multiple pregnancy",1,1,1,1,13.5,15,2,15,,,,20,5,1
1,"2352480","24+4",840,1,36.5,-7.3,1,,,,,".",52,5.7,1,3,1,1,,1,1,1,2,38,47,62,10,2,"1",1,1,1,1,13.4,15,1,,,,,,2,1
1,"2195397","24",520,1,36.1,-6,2,11,8,14,5,"1,2,4",80,6.6,1,1,2,1,,1,1,2,,56,,,13,2,"1",3,2,1,1,11.9,45,2,15,,,,,2,1
1,"2163812","24+6",830,2,35.8,-6,2,,4,,1,".",70,6.1,2,1,1,3,30,1,2,1,2,33,25,84,11,1,"1",1,1,1,1,15.4,30,1,,,,,,1,1
1,"2222896","24+1",567,1,36.3,,3,86,,2,5,"1,3",103,5.2,2,4,2,1,,1,1,2,2,80,8,,11,2,"pih,gdm,iugr",2,1,2,1,18,,1,,,,,,1,3
2,"9368391","24+1",650,2,35,-12,2,30,8,5,1,".",70,8.4,1,2,2,1,,1,1,1,2,11,65,88,17,1,"1",1,1,1,1,16.1,45,1,,,,,20,1,1
1,"2121549","24+2",690,1,34.8,-18,3,14,,3,5,"1,2,4",93,5.9,1,4,2,1,,1,1,2,2,20,,,18,1,"1",1,1,1,1,17.1,30,2,15,,,,,1,1
2,"9155718","24+3",670,2,36.9,2.6,2,,7,,1,".",143,6.7,2,2,1,1,,1,1,1,2,43,34,50,13,1,"aph, prom",1,1,1,2,13.6,15,1,,,,,20,4,2
1,"2249532","24+2",692,1,36.2,-4.4,1,,,,,".",64,6.5,1,3,1,1,,1,1,1,1,57,28,41,11,2,"pih polyhydramnions",1,1,2,1,17,15,1,,,,,,1,1
1,"2158799","24+6",785,2,36.8,-5.3,2,,2,,1,".",68,5.9,2,1,2,1,,1,1,1,2,47,34,22,13,1,"1",1,1,1,1,12.9,30,2,15,,,,,2,1
1,"2200145","24+2",700,1,36,-8.4,2,,8,,5,"1,2",98,8.5,1,1,1,1,,1,2,2,,18,,,15,1,"multiple pregnancy",3,1,1,1,14.5,15,1,,,,,,5,1
2,"6582791","24+1",622,1,36.5,-3.1,2,,18,,1,".",79,4.9,2,4,1,3,145,1,2,2,2,130,91,11,14,1,"poly cysic overy, prom",1,1,1,2,,30,1,,,,,20,4,1
1,"2333205","24",520,1,33,-7.8,2,25,1,5,1,".",80,7.4,2,4,3,1,,1,3,1,2,101,62,53,12,2,"1",1,1,1,1,13,30,1,,,,,,2,3
1,"2280838","24+4",605,1,36.3,-6.9,1,,,,,".",93,6.5,1,1,3,1,,1,1,1,2,93,13,32,12,1,"multiple pregnancy ,preterm labour",3,1,1,1,13.3,45,2,15,,,,,1,2
2,"9317564","24+2",760,2,37.7,-7,2,,12,,5,"1,2",105,7.4,2,1,2,3,38,1,1,1,2,75,38,14,13,2,"smoking during pregnancy, previous ectopic preg",1,1,1,2,14.4,30,2,15,,,,10,2,1
1,"2315346","24+1",432,2,36,-15.8,1,,,,,".",56,7,1,1,1,1,,1,5,2,,2,,,16,2,"1",1,1,1,1,8.1,30,2,15,15,,,10,2,1
1,"2354709","24+1",780,2,36.7,-.8,2,,2,,1,".",91,5.7,2,4,2,1,,1,3,1,2,48,46,44,11,1,"hypertension",3,1,2,1,17.5,15,1,,,,,,2,1
2,"9242646","24+5",770,2,33.7,-16,1,,,,,".",189,8.4,1,4,2,1,,1,1,1,2,55,54,16,17,1,"premature labour",1,1,1,1,10.2,30,2,15,,,15,,5,1
2,"9279549","24+6",690,1,37.3,-9.6,2,,3,,1,".",94,6.2,1,1,2,1,,1,2,1,2,50,37,67,14,1,"oligo hydramnions,prom infection",1,2,1,1,16.5,30,2,15,,10,,30,4,1
1,"2269650","24+6",680,2,33.7,-15.2,3,4,,2,1,".",123,6.3,1,3,2,1,,1,1,2,,31,,,17,2,"smoking during pregnancy",1,1,1,1,13.4,30,2,30,,,,10,2,1
1,"2169993","24+3",610,1,36.1,-5.2,1,,,,,".",87,6.7,1,1,1,1,,1,1,2,,36,,,13,2,"oligohydramnions",1,1,1,1,13.7,45,1,,,,,,4,1
1,"2308798","24+3",750,2,35.9,-6.5,2,,2,,5,"1,2",63,6.2,1,4,1,1,,1,2,1,2,85,91,4,16,1,"sickle cell trait",1,1,1,1,17.4,15,1,,,,,,1,1
1,"2337108","24+3",590,1,37.1,-8.800000000000001,2,,9,,1,".",65,6.9,1,1,3,1,,1,2,1,2,52,71,16,11,2,"multiple pregnancy,gbs positive,candida",1,2,1,1,14.9,15,1,,,,,,1,1
2,"9340229","24+5",550,1,36.1,-13.5,2,,3,,1,".",82,6,1,1,1,1,,1,3,2,,6,,,15,2,"multiple pregnancy,smoked during pregnancy",1,1,1,1,13.3,30,2,15,15,,,10,5,1
2,"6556805","24+4",620,1,36.9,-5.5,1,,,,,".",90,6.7,2,2,1,1,,1,1,1,1,44,32,28,14,2,"maternal high wcc,and crp ?choriamnionitis",1,2,1,1,13.7,,1,,,,,,4,1
1,"2224868","24+2",637,1,35.9,-9.6,2,,1,,5,"1,2",93,,1,1,1,1,,1,1,2,,1,,,17,1,"prom,oligohydramnions",1,1,1,1,8.9,30,2,15,,,,,1,1
1,"2206084","24+2",787,1,35.8,-11.7,2,,1,,1,".",100,7.3,1,2,2,1,,1,2,1,1,48,12,37,15,1,"1",3,1,1,1,14,15,1,,,,,,1,1
2,"9191826","24+4",600,1,35.5,-1.8,1,,,,,".",119,5.4,1,1,1,1,,1,1,1,2,53,35,50,14,2,"polycystic overies",1,1,1,1,18.6,,1,,,,,,4,1
2,"9159561","24+6",760,2,35.4,-6.8,2,,2,,1,".",122,8.1,1,1,1,1,,1,3,2,2,28,,,12,1,"1",1,1,1,1,13.8,15,2,15,,,,10,1,1
1,"2234006","24+4",705,1,36.5,-7.5,2,,1,,1,".",74,5.3,1,1,1,1,,1,1,2,,1,,,15,1,"prom,oligohydramnios,gbs+",1,1,1,2,13.7,15,1,,,,,,1,3
1,"2300497","24+2",590,1,37.5,-5.3,1,,,,,".",100,9.300000000000001,2,2,3,3,122,1,1,1,2,182,127,11,16,1,"multiple",1,1,1,1,13.5,50,2,10,,,,,2,1
1,"2296248","24+4",562,1,36.5,-8.800000000000001,2,,4,,1,".",105,8.5,1,1,2,1,,1,1,1,2,87,19,34,15,1,"1",1,1,1,2,13,45,2,15,,,,,4,1
2,"9376441","24+3",720,2,36.9,,2,,1,,1,".",139,8.800000000000001,1,1,1,1,,1,1,2,,24,,,,1,"ivf pregnancy, dcda twins,anenatal steroids",1,1,1,1,11.7,,1,,,,,,2,1
2,"9340230","24+5",555,1,36.3,-10.1,2,,6,,5,"1,3",139,7,1,1,1,1,,1,5,2,,17,,,14,2,"multiple pregnancy, smoking during pregnancy",1,1,1,1,16.9,45,2,30,,,15,20,5,1
2,"9170052","24+0",630,2,36.8,-6.8,2,25,2,13,5,"1+3",83,7.2,2,4,2,2,28,1,1,1,2,91,42,78,14,1,"cervial suture",3,2,2,1,13.4,45,1,,,,,,1,1
1,"232097","24+5",620,1,34.8,-11.3,1,,,,,".",77,6.2,1,2,1,1,,1,1,1,2,61,,53,17,2,"1",1,1,1,1,14.9,15,1,,,,,10,5,1
1,"2308162","24+1",670,2,36.4,-17.6,1,,,,,".",98,5.4,1,1,1,1,,1,4,2,,6,,,15,2,"1",1,2,1,2,15.1,15,2,15,,,,,2,1
1,"2191396","24+5",670,1,36.8,-11.1,3,7,,1,1,".",81,9.1,2,1,1,1,,1,1,1,2,61,11,49,12,2,"preterm labour",1,1,1,1,12.9,45,2,15,,,,,1,1
2,"9269688","24+3",740,2,36.7,-2.5,2,,7,,1,".",79,6.4,2,1,2,2,29,1,1,1,2,34,33,36,14,1,"1",1,1,1,1,15,15,1,,,,,,2,1
2,"9358107","24+3",680,1,36.7,-10.6,2,,2,,1,".",59,,1,1,1,1,,1,4,2,,2,,,16,2,"antepartum haemmorrhage",1,1,1,2,11.5,15,2,15,,,,30,1,1
1,"2210656","24+1",555,2,35.8,-5.3,2,,3,,5,"1,2,4",141,10,1,1,1,1,,1,2,2,,4,,,15,1,"1",1,1,2,1,14.5,60,2,15,15,,15,80,2,1
2,"6553115","24+2",600,2,34,,1,,,,,".",95,6,2,2,2,1,,1,2,1,1,53,37,,15,1,"twin -twin transfusion,uti (maternal) in labour",3,1,1,1,12.4,,1,,,,,,2,1
1,"2163607","24",670,2,35.1,1.7,1,,,,,".",103,6.5,1,1,1,1,,1,1,1,2,40,24,25,13,2,"unbooked oregnancy",1,1,1,1,14.1,15,1,,,,,,1,2
1,"2358379","24+6",872,2,36.3,-8.800000000000001,2,,3,,,".",61,4.7,1,1,1,1,,1,5,2,,6,,,12,2,"uti, pv bleed",1,1,1,2,14.7,45,2,60,,,,10,1,1
1,"2344426","24+3",650,1,36.8,-11.4,2,,2,,1,".",84,5.9,2,1,2,1,,1,4,1,2,46,62,37,14,2,"choriamnionitis,congenital infection,raised crp",1,2,1,1,10.9,30,1,,,,,,1,1
2,"9041498","24+6",680,2,36,-4.1,2,,19,,5,"1,2,3",85,5,2,1,2,2,6,1,2,1,2,49,39,,15,1,"aph",1,1,1,2,14.7,45,2,15,,,,,1,1
1,"2288698","24+4",940,2,34.5,-16.8,2,,1,,5,"1,2,4",77,5.9,1,1,1,1,,1,1,2,,1,,,16,1,"1",1,1,1,1,9,30,2,15,,,,,2,1
1,"2165810","24+3",685,1,36.4,-11.8,1,,,,,".",68,3.9,1,1,1,1,,1,1,2,,2,,,15,1,"ivf pregnancy, dcda twins",1,1,1,2,18.7,,2,15,,,,,2,1
1,"2300499","24+2",580,1,36.3,-5.6,2,,2,,1,".",68,6.5,1,1,1,1,,1,1,2,,12,,,13,2,"multiple pregnancy",1,1,1,2,15.1,45,2,15,,,,,1,1
2,"9295928","24+3",700,1,35.3,-10.3,2,,17,,1,".",77,5.3,2,2,2,3,32,1,1,1,1,58,47,57,16,1,"pv bleeding, prom",1,1,1,2,15,,1,,,,,,2,1
1,"2203625","24+4",710,1,37.1,-4.1,1,,,,,".",85,6.4,1,1,1,1,,1,1,1,2,39,44,17,14,1,"high crp",1,2,1,1,10.4,45,1,,,,,,2,1
2,"9079903","24+4",465,2,35,-8.1,2,,1,,1,".",112,6.4,1,1,1,2,5,1,3,2,2,10,,,16,2,"1",3,1,2,1,14.9,45,2,30,,,,10,2,1
1,"2121473","24",690,1,36,-8.800000000000001,3,55,,2,1,".",91,5.3,2,1,3,1,,1,5,1,2,84,10,12,15,2,"ivf pregnancy",1,1,1,2,14.2,30,2,15,,,15,,2,1
1,"2357080","24+5",740,2,35.8,-8,1,,,,,".",110,6.3,1,3,1,1,,1,1,1,2,65,2,32,16,1,"multiple pregnancy",1,1,1,1,14.4,15,1,,,,,,2,1
1,"2109524","24+3",780,2,38.2,-17.4,1,,,,,".",108,6,1,4,1,1,,1,5,1,2,48,34,25,11,2,"ivf pregnancy,prem contractions",3,1,1,2,16.3,,1,,,,,10,4,1
2,"9220930","24+4",725,1,35.3,-3.9,3,35,,4,1,".",100,6.2,2,2,1,1,,1,3,1,2,39,58,31,14,2,"1",1,1,1,1,12.5,15,1,,,,,10,2,1
2,"9148104","24",630,1,37,-8.4,1,,,,,".",64,5.3,2,1,2,3,39,1,3,1,2,43,43,29,11,2,"choriamnionitis,prom",1,1,1,2,15.4,,1,,,,,,1,1
2,"9254963","24+2",560,2,36.7,-5.1,3,41,,7,1,".",69,8.1,2,1,3,1,,1,1,1,2,70,34,27,13,2,"pih,antepartum haemorhage",1,1,2,2,12.2,15,1,,,,,,2,2
2,"9210770","24+2",550,1,37,-6.5,2,75,30,5,5,"1,2,3,",75,6.9,2,4,2,1,,1,1,2,,78,69,,14,2,"gdm, multiple pregnancy",1,1,1,2,12.6,60,2,15,,,15,10,5,1
2,"9063013","24+3",840,2,36.9,-5,2,,2,,1,".",57,5.1,1,4,1,3,,1,1,1,2,53,38,4,14,1,"1",1,1,1,1,15.2,30,1,,,,,10,2,1
1,"2169855","24+5",844,2,34.1,-4.6,2,,2,,1,".",94,7.6,1,1,1,1,,1,1,2,,3,,,15,1,"intra uterine fibroid",1,1,1,1,16.1,30,2,45,,,,,2,1
2,"9190188","24+3",765,2,35.7,-5.5,2,,9,,1,".",96,9.19999999999999,2,2,2,3,44,1,1,1,2,50,24,11,12,2,"dcda twins",1,1,1,1,16.5,15,1,,,,,10,1,3
2,"6585640","24+2",608,2,35.8,-4,2,,14,,5,"1,2",116,7.5,1,1,1,1,,1,1,2,2,14,,,13,1,"twin -twin transfusion",1,1,1,1,12.5,30,2,15,15,,30,,2,3
1,"2337110","24+3",640,1,36.8,-7.4,2,,14,,5,"1,2,4",94,8.4,2,1,3,1,,1,4,1,2,39,71,26,12,1,"multiple pregnancy, dcda twins,group b",1,2,1,1,10.2,60,2,30,,,,,1,1
1,"2118798","24+4",678,1,36.3,-3.3,1,,,,,".",134,6.1,2,1,1,1,,1,1,1,1,32,20,40,13,1,"prom",1,2,1,1,13.6,15,1,,,,,,1,1
1,"2291694","24+3",830,2,37.2,-3.7,2,25,3,5,1,".",80,7.2,2,1,3,1,,1,3,1,2,48,14,43,13,1,"pre mature labour",3,1,1,1,16.3,30,2,15,,,,10,2,1
2,"9312120","24+6",700,1,37,-9.5,1,,,,,".",77,10.8,1,1,1,1,,1,3,2,,3,,,15,1,"aph,smoking during pregnancy",1,1,1,2,16.2,30,2,30,,,,10,2,1
1,"2340301","24+5",572,1,,-2,2,,2,,1,".",63,8.19999999999999,1,3,1,1,,1,5,1,2,78,30,43,14,2,"aph,",1,1,1,2,14.9,,1,,,,,,1,1
1,"2203519","24+1",592,1,36.6,-14.8,1,,,,,".",70,6.3,1,1,1,1,,1,2,2,,37,,,15,2,"oligohydramnions,hepB +",3,2,1,1,17.1,15,1,,,,,,4,1
1,"2247247","24",592,1,36.2,-5.3,1,,,,,".",58,7.5,1,1,1,1,,1,1,2,,2,,,16,1,"1",1,1,1,2,9.9,30,2,15,,,,10,2,1
2,"9148153","24+6",690,2,37.2,-8.19999999999999,2,,3,,5,"1,2,3,4",74,9,1,1,1,1,,1,5,2,2,3,,,16,2,"1",3,1,1,1,15.7,45,2,30,,,,20,1,3
1,"2119624","24",668,2,36.5,-5.8,1,,,,,".",119,8.69999999999999,2,1,2,1,,1,2,1,2,125,17,,13,2,"1",1,1,1,1,15.3,45,2,15,,,,,2,1
1,"2353815","24+1",720,1,36.2,-15.5,2,,5,,1,".",94,6.7,2,1,2,1,,1,2,1,2,40,23,26,13,2,"1",1,1,1,1,11.5,45,1,,,,,,2,1
1,"2255851","24",760,1,37.3,-20.4,1,,,,,".",56,5.4,1,1,1,1,,1,3,2,,2,,,16,1,"aph, prom",1,1,1,1,10.4,,1,,,,,,2,3
1,"2335814","24+4",590,1,37.2,-6.9,2,,2,,1,".",82,6.9,2,1,3,3,60,1,5,1,2,283,,,13,2,"srom",1,1,1,1,12.1,45,2,30,,,,,1,1
1,"2333043","24+5",782,2,36.8,-4.7,2,,1,,1,".",97,7.1,2,1,2,1,,1,2,1,2,49,21,41,13,1,"pre term labour",3,1,1,1,13.3,30,1,,,,,10,2,1
2,"9204123","24+6",656,2,35.3,-8.4,2,,7,,5,"1,2",140,8.19999999999999,2,4,2,1,,1,1,1,2,62,136,7,15,2,"smoking during pregnancy",1,1,1,1,12.7,60,2,30,,,15,20,2,1
1,"2247096","24+2",730,2,36.4,-5.3,1,,,,,".",85,9.5,2,3,2,3,30,1,2,1,2,130,75,11,15,1,"prematurity",2,1,1,1,13.6,30,1,,,,,,4,1
1,"2204362","24",641,1,36.1,-3.2,1,,,,,".",124,8.1,1,1,1,1,,1,1,2,,19,,,14,1,"retro virus positive",3,1,1,1,14.9,45,2,,15,,,,1,1
1,"2165808","24+3",770,1,36.2,-5.5,1,,,,,".",114,5.8,2,1,2,3,19,1,1,1,1,55,17,34,13,1,"aph,ivf pregnancy, multiple pregnancy",1,1,1,2,13.6,30,2,15,,,,,2,1
2,"9029560","24+6",750,2,36.5,-2.4,2,,15,,1,".",110,5.5,2,1,2,3,31,1,1,1,2,68,36,34,14,1,"1",3,1,1,1,13.6,30,1,,,,,10,1,1
1,"2123980","24",662,1,36.2,-5.1,1,,,,,".",90,7.2,2,3,1,1,,1,1,1,2,71,82,38,14,1,"prom",1,1,1,1,15.1,30,1,,,,,,1,1
1,"2209011","24+6",680,1,35.7,-6.7,2,,6,,1,".",85,7.6,1,1,3,1,,1,1,1,2,54,34,33,13,1,"aph,ivf pregnancy,multiple pregnancy",2,1,1,2,15,45,2,15,15,,,10,2,1
2,"6551144","24",604,1,34.6,-15.5,2,,10,,5,"1,2,",86,7.2,1,1,1,1,,1,5,2,,14,,,16,2,"1",1,1,1,1,11.6,45,2,30,,,,20,4,1
1,"2173374","24+5",919,1,34.4,-14.4,2,,3,,5,"1,2,3",79,8.4,1,4,1,1,,1,3,1,2,40,21,68,15,1,"choriamnionitis,raised crp",2,2,1,1,17.1,15,1,,,,,,1,1
2,"6565136","24",742,1,36.3,-1.8,2,,3,,1,".",77,5.4,2,4,1,1,,1,1,1,2,29,62,3,14,1,"cervical suture",1,1,1,1,13.2,,1,,,,,,1,1
2,"9204910","24+2",724,2,34.4,-8.300000000000001,1,,,,,".",115,6.4,1,1,2,1,,1,1,1,2,45,12,36,15,1,"hifh bmi",2,1,1,1,10.2,30,1,,,,,,4,1
1,"2193202","24+1",690,1,35.8,-2.5,2,,2,,1,".",115,8.5,2,3,3,1,,1,4,1,2,80,19,39,13,1,"smoking during pregnancy, prom",1,1,1,2,15.2,45,2,15,,,,,1,1
1,"2206669","24",672,1,36.4,-7.8,2,,4,,5,"1&2",107,9.300000000000001,2,1,3,1,,1,1,2,2,42,,,15,1,"uti,high crp",1,2,1,1,14.9,30,1,,,,,,2,1
2,"9204246","24+4",764,2,36,-.6,1,,,,,".",94,6.8,1,1,1,1,,1,1,1,2,38,19,35,12,2,"1",1,1,1,1,16.6,,1,,,,,,2,2
2,"9312119","24+6",640,1,36.5,-9.6,2,,6,,5,"1,2,3",155,10,1,1,1,1,,1,5,2,,6,,,15,1,"antepartum haemmorrhage",1,1,1,2,17.6,45,2,15,15,,,,2,1
1,"2176258","24",598,1,37.4,,2,,4,,1,".",93,6.4,1,1,1,1,,1,1,2,,7,,,17,1,"1",1,1,1,2,8.6,45,2,15,,,15,20,4,1
1,"2308164","24+1",478,1,37.2,-21,2,,,,,".",94,7.6,1,1,1,1,,1,5,2,,2,,,17,2,"multiple pregnancy,discordant growth",1,2,1,2,9.1,30,2,15,,,15,20,5,1
1,"2255850","24",730,1,37.5,-6.9,1,,,,,".",78,8.6,1,1,1,1,,1,1,2,,10,,,14,1,"choriamnionitis,prom,aph",1,2,1,2,13.3,15,1,,,,,10,2,1
1,"2334343","24+3",758,1,36.9,-6.5,1,,,,,".",72,6,2,1,1,2,14,1,3,1,1,50,37,28,13,1,"cervical suture",3,1,1,1,14.5,30,1,,,,,,2,1
1,"2316642","24+6",880,1,34.8,-12.3,2,25,3,1,1,".",83,7.2,1,1,1,3,18,1,2,1,2,37,84,31,11,1,"gbs positive,prom,",1,1,1,2,18.3,,1,,,,,,2,1
1,"2351265","24",574,1,36.4,-11,2,11,4,2,5,"1,2",53,3.3,1,1,1,1,,1,1,2,,8,,,18,1,"iugr,uti,smoking during pregnancy,low lying placeta,oligohydramnions,choriamnionitis,aph",2,2,1,2,11.1,,1,,,,,,2,1
2,"9370274","24",340,1,,,1,,,,,".",,,1,1,1,1,,1,1,2,,1,,,15,2,"iugr,choriamnionitis,pih",1,2,2,1,,,1,,,,,,1,1
1,"2316855","24+3",615,1,35.9,-.9,1,,,,,".",87,8.300000000000001,1,1,3,1,,1,1,1,2,75,22,55,14,2,"aph,multiple pregnancy,dcda twins",3,1,1,2,12.4,15,2,,15,,,,2,1
1,"2316854","24+2",720,1,34,-7.3,2,22,2,2,1,".",67,7.4,2,3,1,1,,1,5,2,2,133,61,,16,1,"dcda twins, anti partum haemorrhage",1,1,1,2,9.5,30,2,15,,,,,1,1
1,"2291480","24+3",700,1,37.2,-1.6,2,,3,,1,".",105,6.1,2,1,3,1,,1,3,1,2,81,58,60,12,1,"prom,oligohydramnions,maternal fibrisis,oligohydramnions",1,1,1,1,14.7,30,1,,,,,,1,1
2,"9100228","24+0",680,2,35.4,-3.4,2,,12,,1,".",85,6.9,2,1,3,1,,1,1,1,2,60,36,14,13,1,"1",3,1,1,1,15.4,30,1,,,,,,2,1
1,"2353280","24+4",750,2,35.5,-7.6,2,,7,,5,"1,2,",69,6.3,1,1,2,1,,1,5,1,2,54,30,26,12,2,"low BM,SMOKING DURING PREGNANCY",1,1,1,1,18.4,30,2,30,,,,,2,1
2,"9081679","24+6",832,1,36,-5.9,2,,5,,1,".",121,5.7,1,2,3,1,,1,3,2,2,69,,,14,1,"polyhydramnions",1,1,1,1,12.3,45,2,30,15,,15,20,2,2
1,"2121474","24",600,1,36.1,-9.19999999999999,2,,5,,5,"1,2,4",93,6.4,1,1,1,1,,1,2,2,,3,,,14,2,"multiple pregnancy,dcda,",1,1,1,2,15.8,30,2,15,,,,10,2,1
2,"9017013","24",615,1,35.9,-4.5,2,,6,,1,".",60,4.5,2,2,2,1,,1,1,1,1,92,88,40,13,1,"prom, gestational diabetes melitus",1,1,1,1,14.1,,1,,,,,,4,1
1,"2183752","24+3",620,1,36,-9.300000000000001,2,,3,,1,".",91,7.3,1,1,1,1,,1,2,2,,18,,,16,1,"aph,uti",1,1,1,2,11.9,45,1,,,,,,4,1
1,"2123018","24+3",542,1,35,-2.2,1,,,,,".",94,4.8,1,1,1,1,,1,3,2,,10,,,14,2,"pr eclampsia",1,1,2,1,18,30,1,,,,,,1,1
2,"6547847","24+6",878,1,36,-6.2,2,19,12,11,1,".",80,4.9,2,1,2,3,39,1,1,1,1,39,46,36,14,1,"1",1,1,1,1,17.5,15,1,,,,,20,1,1
1,"2175318","24",654,2,36.7,-5.6,1,,,,,".",78,7.2,2,1,2,1,,1,3,1,2,47,22,46,14,1,"1",1,1,1,1,13.2,30,2,30,,,15,,1,1
1,"2256358","24+1",650,2,36.6,-3.9,1,,,,,".",57,8.300000000000001,1,1,2,1,,1,4,1,2,44,23,33,16,1,"1",3,1,1,1,15.5,15,1,,,,,,1,1
1,"2259612","24",720,1,39.3,-9.19999999999999,1,,,,,".",75,6.2,1,1,1,1,,1,5,1,1,50,48,55,17,1,"ivf,cervical suture",1,1,1,1,11.6,30,2,15,,,,,1,3
2,"9152000","24+4",730,2,35.7,-2.5,2,,17,,1,".",89,5.2,2,3,2,3,34,1,3,1,2,39,7,,13,1,"aph rise in crp",1,2,1,2,10.3,45,1,,,,,,1,1
2,"6580877","24+0",604,1,36.2,-6.9,2,,1,,1,".",46,11.4,1,1,1,1,,1,1,2,,1,,,15,1,"1",1,1,1,1,13.4,,2,15,,,,,4,1
2,"9372828","24",745,1,35.2,-5.2,2,,13,,1,".",100,8.19999999999999,2,1,3,3,38,1,1,1,2,68,100,,15,1,"1",3,1,1,1,13.4,60,2,15,,,,20,5,3